{"text_format":"3","workbook":"xlsx","n_sheets":4,"sheets":["Simulador","Dados","Prova","Tempo"],"not_rendered":{"images":5,"macros":1,"defined_names":2},"read":"whole","date_system":"1900"}

{"sheet":"Simulador","index":0,"n_rows":30,"n_cols":8,"rows_kept":30,"merged":[[3,26,3,28],[3,29,3,31],[3,32,3,34],[3,35,3,37],[14,5,15,7],[21,5,22,7],[23,5,24,7],[26,5,27,7],[28,5,28,7],[29,5,29,7]]}
[]
[]
[null,12]
[]
[]
[{"$nulls":5},"R1",null,"R2"]
[]
[]
[]
[]
[{"$nulls":5},"R3",null,"R4"]
[]
[]
[]
[{"$nulls":5},{"$f":"IF(Dados!M2=0,\"Req  =  ?\",IF(Dados!L2=\"ABERTO\",\"Req = \"&\"circuito aberto\",\"Req = \"&TEXT(Dados!L2,\"#.##0,00\")&Dados!I2))","v":"Req  =  ?"}]
[]
[]
[]
[]
[]
[]
[{"$nulls":5},"R e s p o s t a  do  aluno"]
[]
[{"$nulls":5},{"$f":"TEXT(Dados!N2,\"#.##0,00\")&Dados!I2","v":"0,00  Ω"}]
[]
[]
[{"$nulls":5},"R e s u l t a d o"]
[]
[{"$nulls":5},{"$f":"IF(Dados!P2=0,\"R e s p o s t a  e r r a d a .\",IF(Dados!P2=1,\"R e s p o s t a  c e r t a .\",\"\"))","v":"R e s p o s t a  e r r a d a ."}]
[{"$nulls":5},{"$f":"IF(Dados!P2=0,\"T e n t e   n o v a m e n t e .\",IF(Dados!P2=1,\"P a r a b é n s !\",\"\"))","v":"T e n t e   n o v a m e n t e ."}]

{"sheet":"Dados","index":1,"n_rows":37,"n_cols":80,"rows_kept":37,"hidden":true,"merged":[[0,1,0,2],[0,12,0,13],[0,14,0,15],[0,22,0,23],[0,26,0,27],[0,36,0,37],[0,46,0,47],[4,0,23,0],[4,1,5,1],[4,2,4,3],[4,4,4,15],[5,4,5,6],[5,7,5,9],[5,10,5,12],[5,13,5,15],[25,0,25,7],[25,8,25,15],[25,16,25,23],[25,24,25,31],[25,32,25,39],[25,40,25,47],[25,48,25,55],[25,56,25,63],[25,64,25,71],[25,72,25,79],[26,3,26,5],[26,6,26,7],[26,11,26,13],[26,14,26,15],[26,19,26,21],[26,22,26,23],[26,27,26,29],[26,30,26,31],[26,35,26,37],[26,38,26,39],[26,43,26,45],[26,46,26,47],[26,51,26,53],[26,54,26,55],[26,59,26,61],[26,62,26,63],[26,67,26,69],[26,70,26,71],[26,75,26,77],[26,78,26,79]]}
["Célula","Auxiliar",null,"R1","R2","R3","R4","Voz","Unidade","R12","R34","Req","Resposta do aluno",null,"Resultado",null,"Início","Ajuda","Auxiliar voz","Botão Resposta","Aux. resistor","Inicial","Tempo",null,"Tempo prova","Tempo faltante","Restante",null,"Aux. tempo","Registro","Nome","Senha","Senha digitada","Senha correta","Reg. escolhido","Nome escolhido","Aux. Senha",null,"Data","Nome","Prova","Amarelo","Vermelho","Senha","Data","Aux. Tempo","Prova",null,"Aux. Início Prova"]
["H10",4,{"$f":"IFERROR(VLOOKUP($B$2,$B$7:$C$24,2,0),\"\")","v":100},{"$nulls":4},"M","  Ω",{"$f":"IFERROR(IF(OR(D3=\"ABERTO\",E3=\"ABERTO\"),\"ABERTO\",D3+E3),\"\")","v":""},{"$f":"IFERROR(IF(OR(F3=\"ABERTO\",G3=\"ABERTO\"),\"ABERTO\",F3+G3),\"\")","v":""},{"$f":"IF(AND(J2=\"ABERTO\",K2<>\"ABERTO\"),K2,IF(AND(J2<>\"ABERTO\",K2=\"ABERTO\"),J2,IF(AND(J2=\"ABERTO\",K2=\"ABERTO\"),\"ABERTO\",IF(AND(J2=0,K2=0),0,IFERROR((J2*K2)/(J2+K2),\"\")))))","v":""},0,{"v":0,"d":"0.00"},{"$f":"IF(L2=0,0,IFERROR(IF(L2=\"\",100,(N2-L2)/L2),\"\"))","v":100},{"$f":"IFERROR(IF(ABS(O2)<=0.005,1,0),\"\")","v":0},1,0,0,1,4,{"v":48628.71484375,"d":"48,628.7"},"00:00:34.301",{"$f":"MINUTE(W2)*60+SECOND(W2)","v":34},{"v":2700,"d":"2,700"},{"$f":"IF((Y2-X2)<0,0,(Y2-X2))","v":{"v":2666,"d":"2,666"}},{"$f":"\"00:\"&INT(Z2/60)&\":\"&Z2-INT(Z2/60)*60","v":"00:44:26"},{"$f":"TEXT(AA2,\"mm:ss\")","v":"44:26"},0,22150,"Antonio de Almeida",22150,22154,{"$f":"IFERROR(VLOOKUP(AI2,$AD$2:$AF$12,3,0),\"\")","v":22154},22154,{"$f":"IFERROR(VLOOKUP(AI2,AD2:AF12,2,0),\"\")","v":"Fernanda da Silva"},0,1,{"$f":"TEXT(DAY(NOW()),\"00\")&\"-\"&TEXT(MONTH(NOW()),\"00\")&\"-\"&TEXT(YEAR(NOW()),\"00\")","v":"05-03-2024"},{"$f":"AG2&\" \"&AM2","v":"22154 05-03-2024"},{"$f":"IF($AI$2=AD2,1,0)","v":0},900,300,"EPC@ECS_2016",{"$f":"TEXT(DAY(NOW()),\"00\")&\"/\"&TEXT(MONTH(NOW()),\"00\")&\"/\"&TEXT(YEAR(NOW()),\"00\")","v":"05/03/2024"},1,"X",{"$f":"IF(AU2=\"\",\"      \"&AD2,AU2&\"    \"&AD2)","v":"X    22150"},0]
[{"$f":"IF(A2=\"F5\",\"F4\",IF(A2=\"H5\",\"H4\",IF(A2=\"F10\",\"F9\",IF(A2=\"H10\",\"H9\",\"\"))))","v":"H9"},null,null,{"$f":"IF(D2=\"\",\"\",(VLOOKUP(D2,$B$7:$D$24,3,0)))","v":""},{"$f":"IF(E2=\"\",\"\",(VLOOKUP(E2,$B$7:$D$24,3,0)))","v":""},"","",{"$nulls":22},22151,"Bernardo de Oliveira",22151,{"$nulls":8},{"$f":"IF($AI$2=AD3,1,0)","v":0},{"$nulls":6},"      22151"]
[{"$nulls":29},22152,"Cristina Antunes",22152,{"$nulls":8},0,{"$nulls":6},"      22152"]
["Valor dos resistores",5,"Valores",null,"Cores dos resistores",{"$nulls":24},22153,"Dagoberto Barbosa",22153,{"$nulls":8},0,{"$nulls":6},{"$f":"IF(AU5=\"\",\"      \"&AD5,AU5&\"    \"&AD5)","v":"      22153"}]
[null,null,"Nominal","Absoluto","1ª banda",null,null,"2ª banda",null,null,"Multiplicador",null,null,"Tolerância",{"$nulls":15},22154,"Fernanda da Silva",22154,{"$nulls":8},1,{"$nulls":5},"X","X    22154"]
[null,0,"ABERTO","ABERTO",{"$nulls":25},22155,"Gilberto Pereira",22155,{"$nulls":8},0,{"$nulls":6},"      22155"]
[null,1,"CURTO",0,{"$nulls":25},22156,"Haroldo Carvalho",22156,{"$nulls":8},0,{"$nulls":6},"      22156"]
[null,2,1,1,150,75,0,0,0,0,218,165,32,150,75,0,{"$nulls":13},22157,"Marcelo Sato",22157,{"$nulls":8},0,{"$nulls":6},"      22157"]
[null,3,10,10,150,75,0,0,0,0,0,0,0,150,75,0,{"$nulls":13},22158,"Nádia de Souza",22158,{"$nulls":8},0,{"$nulls":6},"      22158"]
[null,4,100,100,150,75,0,0,0,0,150,75,0,150,75,0,{"$nulls":13},22159,"Paulo dos Santos",22159,{"$nulls":8},0,{"$nulls":6},"      22159"]
[null,5,120,120,150,75,0,255,0,0,150,75,0,150,75,0,{"$nulls":13},22160,"Ricardo Mello",22160,{"$nulls":8},0,{"$nulls":6},"      22160"]
[null,6,150,150,150,75,0,0,255,0,150,75,0,150,75,0]
[null,7,180,180,150,75,0,192,192,192,150,75,0,150,75,0]
[null,8,220,220,255,0,0,255,0,0,150,75,0,150,75,0]
[null,9,470,470,255,255,0,238,130,238,150,75,0,150,75,0]
[null,10,"1K",1000,150,75,0,0,0,0,255,0,0,150,75,0]
[null,11,"2K2",2200,255,0,0,255,0,0,255,0,0,150,75,0]
[null,12,"3K9",3900,255,165,0,255,255,255,255,0,0,150,75,0]
[null,13,"5K6",5600,0,255,0,0,0,255,255,0,0,150,75,0]
[null,14,"6K8",6800,0,0,255,192,192,192,255,0,0,150,75,0]
[null,15,"8K2",8200,192,192,192,255,0,0,255,0,0,150,75,0]
[null,16,"9K1",9100,255,255,255,150,75,0,255,0,0,150,75,0]
[null,17,"10K",10000,150,75,0,0,0,0,255,165,0,150,75,0]
[]
["Teste 1",{"$nulls":7},"Teste 2",{"$nulls":7},"Teste 3",{"$nulls":7},"Teste 4",{"$nulls":7},"Teste 5",{"$nulls":7},"Teste 6",{"$nulls":7},"Teste 7",{"$nulls":7},"Teste 8",{"$nulls":7},"Teste 9",{"$nulls":7},"Teste 10"]
["Resistor","Item","Valor","Resposta",null,null,"Aluno",null,"Resistor","Item","Valor","Resposta",null,null,"Aluno",null,"Resistor","Item","Valor","Resposta",null,null,"Aluno",null,"Resistor","Item","Valor","Resposta",null,null,"Aluno",null,"Resistor","Item","Valor","Resposta",null,null,"Aluno",null,"Resistor","Item","Valor","Resposta",null,null,"Aluno",null,"Resistor","Item","Valor","Resposta",null,null,"Aluno",null,"Resistor","Item","Valor","Resposta",null,null,"Aluno",null,"Resistor","Item","Valor","Resposta",null,null,"Aluno",null,"Resistor","Item","Valor","Resposta",null,null,"Aluno"]
["R1",7,{"$f":"VLOOKUP(B28,$B$7:$D$24,3,0)","v":{"v":180,"d":"180.00"}},{"v":221,"d":"221.00"},1,{"$f":"TEXT(D28,\"#.##0,00\")","v":"221,00"},2,{"$f":"IF(E28=G28,1,0)","v":0},"R1",10,{"$f":"VLOOKUP(J28,$B$7:$D$24,3,0)","v":{"v":1000,"d":"1,000.00"}},{"v":898.2,"d":"898.20"},2,{"$f":"TEXT(L28,\"#.##0,00\")","v":"898,20"},4,{"$f":"IF(M28=O28,1,0)","v":0},"R1",8,{"$f":"VLOOKUP(R28,$B$7:$D$24,3,0)","v":{"v":220,"d":"220.00"}},{"v":1921.1584327086882,"d":"1,921.16"},1,{"$f":"TEXT(T28,\"#.##0,00\")","v":"1.921,16"},4,{"$f":"IF(U28=W28,1,0)","v":0},"R1",4,{"$f":"VLOOKUP(Z28,$B$7:$D$24,3,0)","v":{"v":100,"d":"100.00"}},{"v":815.377493849723,"d":"815.38"},4,{"$f":"TEXT(AB28,\"#.##0,00\")","v":"815,38"},null,{"$f":"IF(AC28=AE28,1,0)","v":0},"R1",9,{"$f":"VLOOKUP(AH28,$B$7:$D$24,3,0)","v":{"v":470,"d":"470.00"}},{"v":469.5501730103806,"d":"469.55"},1,{"$f":"TEXT(AJ28,\"#.##0,00\")","v":"469,55"},null,{"$f":"IF(AK28=AM28,1,0)","v":0},"R1",5,{"$f":"VLOOKUP(AP28,$B$7:$D$24,3,0)","v":{"v":120,"d":"120.00"}},{"v":137.6086805574596,"d":"137.61"},2,{"$f":"TEXT(AR28,\"#.##0,00\")","v":"137,61"},null,{"$f":"IF(AS28=AU28,1,0)","v":0},"R1",3,{"$f":"VLOOKUP(AX28,$B$7:$D$24,3,0)","v":{"v":10,"d":"10.00"}},{"v":136.60512230857162,"d":"136.61"},2,{"$f":"TEXT(AZ28,\"#.##0,00\")","v":"136,61"},null,{"$f":"IF(BA28=BC28,1,0)","v":0},"R1",4,{"$f":"VLOOKUP(BF28,$B$7:$D$24,3,0)","v":{"v":100,"d":"100.00"}},{"v":986.8365180467091,"d":"986.84"},1,{"$f":"TEXT(BH28,\"#.##0,00\")","v":"986,84"},null,{"$f":"IF(BI28=BK28,1,0)","v":0},"R1",8,{"$f":"VLOOKUP(BN28,$B$7:$D$24,3,0)","v":{"v":220,"d":"220.00"}},{"v":1470.7699510250186,"d":"1,470.77"},4,{"$f":"TEXT(BP28,\"#.##0,00\")","v":"1.470,77"},null,{"$f":"IF(BQ28=BS28,1,0)","v":0},"R1",17,{"$f":"VLOOKUP(BV28,$B$7:$D$24,3,0)","v":{"v":10000,"d":"10,000.00"}},{"v":104.69805194805194,"d":"104.70"},3,{"$f":"TEXT(BX28,\"#.##0,00\")","v":"104,70"},null,{"$f":"IF(BY28=CA28,1,0)","v":0}]
["R2",0,{"$f":"VLOOKUP(B29,$B$7:$D$24,3,0)","v":"ABERTO"},{"v":186.1499997138977,"d":"186.15"},null,{"$f":"TEXT(D29,\"#.##0,00\")","v":"186,15"},{"$f":"IF(G28=\"\",0,1)","v":1},null,"R2",3,{"$f":"VLOOKUP(J29,$B$7:$D$24,3,0)","v":{"v":10,"d":"10.00"}},{"v":1010,"d":"1,010.00"},null,{"$f":"TEXT(L29,\"#.##0,00\")","v":"1.010,00"},{"$f":"IF(O28=\"\",0,1)","v":1},null,"R2",11,{"$f":"VLOOKUP(R29,$B$7:$D$24,3,0)","v":{"v":2200,"d":"2,200.00"}},{"v":1636.611334658197,"d":"1,636.61"},null,{"$f":"TEXT(T29,\"#.##0,00\")","v":"1.636,61"},{"$f":"IF(W28=\"\",0,1)","v":1},null,"R2",13,{"$f":"VLOOKUP(Z29,$B$7:$D$24,3,0)","v":{"v":5600,"d":"5,600.00"}},{"v":854.1908757693577,"d":"854.19"},null,{"$f":"TEXT(AB29,\"#.##0,00\")","v":"854,19"},{"$f":"IF(AE28=\"\",0,1)","v":0},null,"R2",5,{"$f":"VLOOKUP(AH29,$B$7:$D$24,3,0)","v":{"v":120,"d":"120.00"}},{"v":399.74098040566724,"d":"399.74"},null,{"$f":"TEXT(AJ29,\"#.##0,00\")","v":"399,74"},{"$f":"IF(AM28=\"\",0,1)","v":0},null,"R2",3,{"$f":"VLOOKUP(AP29,$B$7:$D$24,3,0)","v":{"v":10,"d":"10.00"}},{"v":119.4375,"d":"119.44"},null,{"$f":"TEXT(AR29,\"#.##0,00\")","v":"119,44"},{"$f":"IF(AU28=\"\",0,1)","v":0},null,"R2",6,{"$f":"VLOOKUP(AX29,$B$7:$D$24,3,0)","v":{"v":150,"d":"150.00"}},{"v":157.91190864600327,"d":"157.91"},null,{"$f":"TEXT(AZ29,\"#.##0,00\")","v":"157,91"},{"$f":"IF(BC28=\"\",0,1)","v":0},null,"R2",15,{"$f":"VLOOKUP(BF29,$B$7:$D$24,3,0)","v":{"v":8200,"d":"8,200.00"}},{"v":840.9643736460152,"d":"840.96"},null,{"$f":"TEXT(BH29,\"#.##0,00\")","v":"840,96"},{"$f":"IF(BK28=\"\",0,1)","v":0},null,"R2",13,{"$f":"VLOOKUP(BN29,$B$7:$D$24,3,0)","v":{"v":5600,"d":"5,600.00"}},{"v":1895.9282703895672,"d":"1,895.93"},null,{"$f":"TEXT(BP29,\"#.##0,00\")","v":"1.895,93"},{"$f":"IF(BS28=\"\",0,1)","v":0},null,"R2",11,{"$f":"VLOOKUP(BV29,$B$7:$D$24,3,0)","v":{"v":2200,"d":"2,200.00"}},{"v":137.93362199455112,"d":"137.93"},null,{"$f":"TEXT(BX29,\"#.##0,00\")","v":"137,93"},{"$f":"IF(CA28=\"\",0,1)","v":0}]
["R3",2,{"v":1,"d":"1.00"},{"v":255.04444445967673,"d":"255.04"},null,"255,04",null,null,"R3",13,{"v":5600,"d":"5,600.00"},{"v":861.7299999594688,"d":"861.73"},null,"861,73",null,null,"R3",16,{"v":9100,"d":"9,100.00"},{"v":1714.7925897239218,"d":"1,714.79"},null,"1.714,79",null,null,"R3",10,{"v":1000,"d":"1,000.00"},{"v":1100.857785899502,"d":"1,100.86"},null,"1.100,86",null,null,"R3",4,{"v":100,"d":"100.00"},{"v":417.9451558523937,"d":"417.95"},null,"417,95",null,null,"R3",9,{"v":470,"d":"470.00"},{"v":103.44854165315628,"d":"103.45"},null,"103,45",null,null,"R3",15,{"v":8200,"d":"8,200.00"},{"v":141.37071779928434,"d":"141.37"},null,"141,37",null,null,"R3",5,{"v":120,"d":"120.00"},{"v":1136.0119957537154,"d":"1,136.01"},null,"1.136,01",null,null,"R3",4,{"v":100,"d":"100.00"},{"v":1402.4905090582195,"d":"1,402.49"},null,"1.402,49",null,null,"R3",1,{"v":0,"d":"0.00"},{"v":118.83116883116882,"d":"118.83"},null,"118,83"]
["R4",8,{"v":220,"d":"220.00"},{"v":191.70333330631254,"d":"191.70"},null,"191,70",null,null,"R4",0,"ABERTO",{"v":1162.1388889193533,"d":"1,162.14"},null,"1.162,14",null,null,"R4",8,{"v":220,"d":"220.00"},{"v":2209.971086534345,"d":"2,209.97"},null,"2.209,97",null,null,"R4",6,{"v":150,"d":"150.00"},{"v":956.9343065693431,"d":"956.93"},null,"956,93",null,null,"R4",11,{"v":2200,"d":"2,200.00"},{"v":540.6215878812911,"d":"540.62"},null,"540,62",null,null,"R4",10,{"v":1000,"d":"1,000.00"},{"v":103.89375,"d":"103.89"},null,"103,89",null,null,"R4",12,{"v":3900,"d":"3,900.00"},{"v":182.10980605782294,"d":"182.11"},null,"182,11",null,null,"R4",10,{"v":1000,"d":"1,000.00"},{"v":875.7028665281405,"d":"875.70"},null,"875,70",null,null,"R4",11,{"v":2200,"d":"2,200.00"},{"v":1648.5221674876848,"d":"1,648.52"},null,"1.648,52",null,null,"R4",5,{"v":120,"d":"120.00"},{"v":105.02982665068143,"d":"105.03"},null,"105,03"]
["R12",null,{"$f":"IFERROR(IF(OR(C28=\"ABERTO\",C29=\"ABERTO\"),\"ABERTO\",C28+C29),\"\")","v":"ABERTO"},{"$nulls":5},"R12",null,{"$f":"IFERROR(IF(OR(K28=\"ABERTO\",K29=\"ABERTO\"),\"ABERTO\",K28+K29),\"\")","v":{"v":1010,"d":"1,010.00"}},{"$nulls":5},"R12",null,{"$f":"IFERROR(IF(OR(S28=\"ABERTO\",S29=\"ABERTO\"),\"ABERTO\",S28+S29),\"\")","v":{"v":2420,"d":"2,420.00"}},{"$nulls":5},"R12",null,{"$f":"IFERROR(IF(OR(AA28=\"ABERTO\",AA29=\"ABERTO\"),\"ABERTO\",AA28+AA29),\"\")","v":{"v":5700,"d":"5,700.00"}},{"$nulls":5},"R12",null,{"$f":"IFERROR(IF(OR(AI28=\"ABERTO\",AI29=\"ABERTO\"),\"ABERTO\",AI28+AI29),\"\")","v":{"v":590,"d":"590.00"}},{"$nulls":5},"R12",null,{"$f":"IFERROR(IF(OR(AQ28=\"ABERTO\",AQ29=\"ABERTO\"),\"ABERTO\",AQ28+AQ29),\"\")","v":{"v":130,"d":"130.00"}},{"$nulls":5},"R12",null,{"$f":"IFERROR(IF(OR(AY28=\"ABERTO\",AY29=\"ABERTO\"),\"ABERTO\",AY28+AY29),\"\")","v":{"v":160,"d":"160.00"}},{"$nulls":5},"R12",null,{"$f":"IFERROR(IF(OR(BG28=\"ABERTO\",BG29=\"ABERTO\"),\"ABERTO\",BG28+BG29),\"\")","v":{"v":8300,"d":"8,300.00"}},{"$nulls":5},"R12",null,{"$f":"IFERROR(IF(OR(BO28=\"ABERTO\",BO29=\"ABERTO\"),\"ABERTO\",BO28+BO29),\"\")","v":{"v":5820,"d":"5,820.00"}},{"$nulls":5},"R12",null,{"$f":"IFERROR(IF(OR(BW28=\"ABERTO\",BW29=\"ABERTO\"),\"ABERTO\",BW28+BW29),\"\")","v":{"v":12200,"d":"12,200.00"}}]
["R34",null,{"$f":"IFERROR(IF(OR(C30=\"ABERTO\",C31=\"ABERTO\"),\"ABERTO\",C30+C31),\"\")","v":{"v":221,"d":"221.00"}},{"$nulls":5},"R34",null,{"$f":"IFERROR(IF(OR(K30=\"ABERTO\",K31=\"ABERTO\"),\"ABERTO\",K30+K31),\"\")","v":"ABERTO"},{"$nulls":5},"R34",null,{"$f":"IFERROR(IF(OR(S30=\"ABERTO\",S31=\"ABERTO\"),\"ABERTO\",S30+S31),\"\")","v":{"v":9320,"d":"9,320.00"}},{"$nulls":5},"R34",null,{"$f":"IFERROR(IF(OR(AA30=\"ABERTO\",AA31=\"ABERTO\"),\"ABERTO\",AA30+AA31),\"\")","v":{"v":1150,"d":"1,150.00"}},{"$nulls":5},"R34",null,{"$f":"IFERROR(IF(OR(AI30=\"ABERTO\",AI31=\"ABERTO\"),\"ABERTO\",AI30+AI31),\"\")","v":{"v":2300,"d":"2,300.00"}},{"$nulls":5},"R34",null,{"$f":"IFERROR(IF(OR(AQ30=\"ABERTO\",AQ31=\"ABERTO\"),\"ABERTO\",AQ30+AQ31),\"\")","v":{"v":1470,"d":"1,470.00"}},{"$nulls":5},"R34",null,{"$f":"IFERROR(IF(OR(AY30=\"ABERTO\",AY31=\"ABERTO\"),\"ABERTO\",AY30+AY31),\"\")","v":{"v":12100,"d":"12,100.00"}},{"$nulls":5},"R34",null,{"$f":"IFERROR(IF(OR(BG30=\"ABERTO\",BG31=\"ABERTO\"),\"ABERTO\",BG30+BG31),\"\")","v":{"v":1120,"d":"1,120.00"}},{"$nulls":5},"R34",null,{"$f":"IFERROR(IF(OR(BO30=\"ABERTO\",BO31=\"ABERTO\"),\"ABERTO\",BO30+BO31),\"\")","v":{"v":2300,"d":"2,300.00"}},{"$nulls":5},"R34",null,{"$f":"IFERROR(IF(OR(BW30=\"ABERTO\",BW31=\"ABERTO\"),\"ABERTO\",BW30+BW31),\"\")","v":{"v":120,"d":"120.00"}}]
["Req",null,{"$f":"IFERROR(IF(AND(C32=\"ABERTO\",C33<>\"ABERTO\"),C33,IF(AND(C32<>\"ABERTO\",C33=\"ABERTO\"),C32,IF(AND(C32=\"ABERTO\",C33=\"ABERTO\"),\"ABERTO\",(C32*C33)/(C32+C33)))),\"\")","v":{"v":221,"d":"221.00"}},{"$nulls":5},"Req",null,{"$f":"IFERROR(IF(AND(K32=\"ABERTO\",K33<>\"ABERTO\"),K33,IF(AND(K32<>\"ABERTO\",K33=\"ABERTO\"),K32,IF(AND(K32=\"ABERTO\",K33=\"ABERTO\"),\"ABERTO\",(K32*K33)/(K32+K33)))),\"\")","v":{"v":1010,"d":"1,010.00"}},{"$nulls":5},"Req",null,{"$f":"IFERROR(IF(AND(S32=\"ABERTO\",S33<>\"ABERTO\"),S33,IF(AND(S32<>\"ABERTO\",S33=\"ABERTO\"),S32,IF(AND(S32=\"ABERTO\",S33=\"ABERTO\"),\"ABERTO\",(S32*S33)/(S32+S33)))),\"\")","v":{"v":1921.1584327086882,"d":"1,921.16"}},{"$nulls":5},"Req",null,{"$f":"IFERROR(IF(AND(AA32=\"ABERTO\",AA33<>\"ABERTO\"),AA33,IF(AND(AA32<>\"ABERTO\",AA33=\"ABERTO\"),AA32,IF(AND(AA32=\"ABERTO\",AA33=\"ABERTO\"),\"ABERTO\",(AA32*AA33)/(AA32+AA33)))),\"\")","v":{"v":956.9343065693431,"d":"956.93"}},{"$nulls":5},"Req",null,{"$f":"IFERROR(IF(AND(AI32=\"ABERTO\",AI33<>\"ABERTO\"),AI33,IF(AND(AI32<>\"ABERTO\",AI33=\"ABERTO\"),AI32,IF(AND(AI32=\"ABERTO\",AI33=\"ABERTO\"),\"ABERTO\",(AI32*AI33)/(AI32+AI33)))),\"\")","v":{"v":469.5501730103806,"d":"469.55"}},{"$nulls":5},"Req",null,{"$f":"IFERROR(IF(AND(AQ32=\"ABERTO\",AQ33<>\"ABERTO\"),AQ33,IF(AND(AQ32<>\"ABERTO\",AQ33=\"ABERTO\"),AQ32,IF(AND(AQ32=\"ABERTO\",AQ33=\"ABERTO\"),\"ABERTO\",(AQ32*AQ33)/(AQ32+AQ33)))),\"\")","v":{"v":119.4375,"d":"119.44"}},{"$nulls":5},"Req",null,{"$f":"IFERROR(IF(AND(AY32=\"ABERTO\",AY33<>\"ABERTO\"),AY33,IF(AND(AY32<>\"ABERTO\",AY33=\"ABERTO\"),AY32,IF(AND(AY32=\"ABERTO\",AY33=\"ABERTO\"),\"ABERTO\",(AY32*AY33)/(AY32+AY33)))),\"\")","v":{"v":157.91190864600327,"d":"157.91"}},{"$nulls":5},"Req",null,{"$f":"IFERROR(IF(AND(BG32=\"ABERTO\",BG33<>\"ABERTO\"),BG33,IF(AND(BG32<>\"ABERTO\",BG33=\"ABERTO\"),BG32,IF(AND(BG32=\"ABERTO\",BG33=\"ABERTO\"),\"ABERTO\",(BG32*BG33)/(BG32+BG33)))),\"\")","v":{"v":986.8365180467091,"d":"986.84"}},{"$nulls":5},"Req",null,{"$f":"IFERROR(IF(AND(BO32=\"ABERTO\",BO33<>\"ABERTO\"),BO33,IF(AND(BO32<>\"ABERTO\",BO33=\"ABERTO\"),BO32,IF(AND(BO32=\"ABERTO\",BO33=\"ABERTO\"),\"ABERTO\",(BO32*BO33)/(BO32+BO33)))),\"\")","v":{"v":1648.5221674876848,"d":"1,648.52"}},{"$nulls":5},"Req",null,{"$f":"IFERROR(IF(AND(BW32=\"ABERTO\",BW33<>\"ABERTO\"),BW33,IF(AND(BW32<>\"ABERTO\",BW33=\"ABERTO\"),BW32,IF(AND(BW32=\"ABERTO\",BW33=\"ABERTO\"),\"ABERTO\",(BW32*BW33)/(BW32+BW33)))),\"\")","v":{"v":118.83116883116882,"d":"118.83"}}]
[]
["Teste","Nota","Respondidas","Início teste"]
[0,{"$f":"TEXT(H28+P28+X28+AF28+AN28+AV28+BD28+BL28+BT28+CB28,\"#.##0,0\")","v":"0,0"},{"$f":"G29+O29+W29+AE29+AM29+AU29+BC29+BK29+BS29+CA29","v":3},1]

{"sheet":"Prova","index":2,"n_rows":104,"n_cols":14,"rows_kept":104,"merged":[[1,4,1,11],[2,4,2,11],[3,4,3,11],[4,4,4,11],[6,1,6,6],[6,7,6,8],[6,9,6,14],[7,1,7,14],[8,1,8,11],[8,12,8,14],[9,1,9,11],[9,12,9,14],[10,1,10,2],[10,13,10,14],[11,1,11,2],[11,13,11,14],[16,2,16,4],[16,5,16,7],[16,8,16,10],[16,11,16,13],[25,2,25,4],[25,5,25,7],[25,8,25,10],[25,11,25,13],[34,2,34,4],[34,5,34,7],[34,8,34,10],[34,11,34,13],[43,2,43,4],[43,5,43,7],[43,8,43,10],[43,11,43,13],[49,13,49,14],[52,2,52,4],[52,5,52,7],[52,8,52,10],[52,11,52,13],[61,2,61,4],[61,5,61,7],[61,8,61,10],[61,11,61,13],[70,2,70,4],[70,5,70,7],[70,8,70,10],[70,11,70,13],[79,2,79,4],[79,5,79,7],[79,8,79,10],[79,11,79,13],[88,2,88,4],[88,5,88,7],[88,8,88,10],[88,11,88,13],[97,2,97,4],[97,5,97,7],[97,8,97,10],[97,11,97,13],[103,13,103,14]]}
[]
[{"$nulls":4},"EPC  AUTOMAÇÃO  LIMITADA"]
[{"$nulls":4},"Rua  Eliza  Flaquer,  70,  sala  124  -  Centro  -  Santo  André"]
[{"$nulls":4},"CEP:  09020-160  -  (11)  2379-4702"]
[{"$nulls":4},"www.epcautomacao.com.br"]
[]
[null,"Curso:  Eletrônica",{"$nulls":5},"Prova  A1",null,{"$f":"\"Data:  \"&Dados!AS2","v":"Data:  05/03/2024"}]
[null,"Disciplina:  Eletrônica  Básica"]
[null,"Prof.:  Marcelo  Junqueira",{"$nulls":10},"Série:  2ª N"]
[null,{"$f":"\"Aluno:  \" & Dados!AJ2","v":"Aluno:  Fernanda da Silva"},{"$nulls":10},{"$f":"\"Registro:  \"&Dados!AI2","v":"Registro:  22154"}]
[null,"Questões",null,1,2,3,4,5,6,7,8,9,10,"Nota final"]
[null,"Nota parcial",null,{"$f":"Dados!H28","v":{"v":0,"d":"0.0"}},{"$f":"Dados!P28","v":{"v":0,"d":"0.0"}},{"$f":"Dados!X28","v":{"v":0,"d":"0.0"}},{"$f":"Dados!AF28","v":{"v":0,"d":"0.0"}},{"$f":"Dados!AN28","v":{"v":0,"d":"0.0"}},{"$f":"Dados!AV28","v":{"v":0,"d":"0.0"}},{"$f":"Dados!BD28","v":{"v":0,"d":"0.0"}},{"$f":"Dados!BL28","v":{"v":0,"d":"0.0"}},{"$f":"Dados!BT28","v":{"v":0,"d":"0.0"}},{"$f":"Dados!CB28","v":{"v":0,"d":"0.0"}},{"$f":"Dados!B37","v":"0,0"}]
[]
[null,"Questões:"]
[]
[null,"1) Qual a resistência equivalente (Req) do circuito?"]
[null,null,{"$f":"\"R1 = \"&Dados!C28&IF(Dados!C28=\"ABERTO\",\"\",\"  \"&Dados!$I$2)","v":"R1 = 180    Ω"},null,null,{"$f":"\"R2 = \"&Dados!C29&IF(Dados!C29=\"ABERTO\",\"\",\"  \"&Dados!$I$2)","v":"R2 = ABERTO"},null,null,{"$f":"\"R3 = \"&Dados!C30&IF(Dados!C30=\"ABERTO\",\"\",\"  \"&Dados!$I$2)","v":"R3 = 1    Ω"},null,null,{"$f":"\"R4 = \"&Dados!C31&IF(Dados!C31=\"ABERTO\",\"\",\"  \"&Dados!$I$2)","v":"R4 = 220    Ω"}]
[]
[null,null,"Resp.\naluno"]
[null,null,{"$f":"IF(Dados!$G$28=1,\"X\",\"\")","v":""},{"$f":"\"     a)  \"&TEXT(Dados!F28,\"0,00\")&\" \"&Dados!$I$2","v":"     a)  221,00   Ω"}]
[null,null,{"$f":"IF(Dados!$G$28=2,\"X\",\"\")","v":"X"},{"$f":"\"     b)  \"&TEXT(Dados!F29,\"0,00\")&\" \"&Dados!$I$2","v":"     b)  186,15   Ω"}]
[null,null,{"$f":"IF(Dados!$G$28=3,\"X\",\"\")","v":""},{"$f":"\"     c)  \"&TEXT(Dados!F30,\"0,00\")&\" \"&Dados!$I$2","v":"     c)  255,04   Ω"}]
[null,null,{"$f":"IF(Dados!$G$28=4,\"X\",\"\")","v":""},{"$f":"\"     d)  \"&TEXT(Dados!F31,\"0,00\")&\" \"&Dados!$I$2","v":"     d)  191,70   Ω"}]
[]
[null,"2) Qual a resistência equivalente (Req) do circuito?"]
[null,null,{"$f":"\"R1 = \"&Dados!K28&IF(Dados!K28=\"ABERTO\",\"\",\"  \"&Dados!$I$2)","v":"R1 = 1000    Ω"},null,null,{"$f":"\"R2 = \"&Dados!K29&IF(Dados!K29=\"ABERTO\",\"\",\"  \"&Dados!$I$2)","v":"R2 = 10    Ω"},null,null,{"$f":"\"R3 = \"&Dados!K30&IF(Dados!K30=\"ABERTO\",\"\",\"  \"&Dados!$I$2)","v":"R3 = 5600    Ω"},null,null,{"$f":"\"R4 = \"&Dados!K31&IF(Dados!K31=\"ABERTO\",\"\",\"  \"&Dados!$I$2)","v":"R4 = ABERTO"}]
[]
[null,null,"Resp.\naluno"]
[null,null,{"$f":"IF(Dados!$O$28=1,\"X\",\"\")","v":""},{"$f":"\"     a)  \"&TEXT(Dados!N28,\"0,00\")&\" \"&Dados!$I$2","v":"     a)  898,20   Ω"}]
[null,null,{"$f":"IF(Dados!$O$28=2,\"X\",\"\")","v":""},{"$f":"\"     b)  \"&TEXT(Dados!N29,\"0,00\")&\" \"&Dados!$I$2","v":"     b)  1010,00   Ω"}]
[null,null,{"$f":"IF(Dados!$O$28=3,\"X\",\"\")","v":""},{"$f":"\"     c)  \"&TEXT(Dados!N30,\"0,00\")&\" \"&Dados!$I$2","v":"     c)  861,73   Ω"}]
[null,null,{"$f":"IF(Dados!$O$28=4,\"X\",\"\")","v":"X"},{"$f":"\"     d)  \"&TEXT(Dados!N31,\"0,00\")&\" \"&Dados!$I$2","v":"     d)  1162,14   Ω"}]
[]
[null,"3) Qual a resistência equivalente (Req) do circuito?"]
[null,null,{"$f":"\"R1 = \"&Dados!S28&IF(Dados!S28=\"ABERTO\",\"\",\"  \"&Dados!$I$2)","v":"R1 = 220    Ω"},null,null,{"$f":"\"R2 = \"&Dados!S29&IF(Dados!S29=\"ABERTO\",\"\",\"  \"&Dados!$I$2)","v":"R2 = 2200    Ω"},null,null,{"$f":"\"R3 = \"&Dados!S30&IF(Dados!S30=\"ABERTO\",\"\",\"  \"&Dados!$I$2)","v":"R3 = 9100    Ω"},null,null,{"$f":"\"R4 = \"&Dados!S31&IF(Dados!S31=\"ABERTO\",\"\",\"  \"&Dados!$I$2)","v":"R4 = 220    Ω"}]
[]
[null,null,"Resp.\naluno"]
[null,null,{"$f":"IF(Dados!$W$28=1,\"X\",\"\")","v":""},{"$f":"\"     a)  \"&TEXT(Dados!V28,\"0,00\")&\" \"&Dados!$I$2","v":"     a)  1921,16   Ω"}]
[null,null,{"$f":"IF(Dados!$W$28=2,\"X\",\"\")","v":""},{"$f":"\"     b)  \"&TEXT(Dados!V29,\"0,00\")&\" \"&Dados!$I$2","v":"     b)  1636,61   Ω"}]
[null,null,{"$f":"IF(Dados!$W$28=3,\"X\",\"\")","v":""},{"$f":"\"     c)  \"&TEXT(Dados!V30,\"0,00\")&\" \"&Dados!$I$2","v":"     c)  1714,79   Ω"}]
[null,null,{"$f":"IF(Dados!$W$28=4,\"X\",\"\")","v":"X"},{"$f":"\"     d)  \"&TEXT(Dados!V31,\"0,00\")&\" \"&Dados!$I$2","v":"     d)  2209,97   Ω"}]
[]
[null,"4) Qual a resistência equivalente (Req) do circuito?"]
[null,null,{"$f":"\"R1 = \"&Dados!AA28&IF(Dados!AA28=\"ABERTO\",\"\",\"  \"&Dados!$I$2)","v":"R1 = 100    Ω"},null,null,{"$f":"\"R2 = \"&Dados!AA29&IF(Dados!AA29=\"ABERTO\",\"\",\"  \"&Dados!$I$2)","v":"R2 = 5600    Ω"},null,null,{"$f":"\"R3 = \"&Dados!AA30&IF(Dados!AA30=\"ABERTO\",\"\",\"  \"&Dados!$I$2)","v":"R3 = 1000    Ω"},null,null,{"$f":"\"R4 = \"&Dados!AA31&IF(Dados!AA31=\"ABERTO\",\"\",\"  \"&Dados!$I$2)","v":"R4 = 150    Ω"}]
[]
[null,null,"Resp.\naluno"]
[null,null,{"$f":"IF(Dados!$AE$28=1,\"X\",\"\")","v":""},{"$f":"\"     a)  \"&TEXT(Dados!AD28,\"0,00\")&\" \"&Dados!$I$2","v":"     a)  815,38   Ω"}]
[null,null,{"$f":"IF(Dados!$AE$28=2,\"X\",\"\")","v":""},{"$f":"\"     b)  \"&TEXT(Dados!AD29,\"0,00\")&\" \"&Dados!$I$2","v":"     b)  854,19   Ω"}]
[null,null,{"$f":"IF(Dados!$AE$28=3,\"X\",\"\")","v":""},{"$f":"\"     c)  \"&TEXT(Dados!AD30,\"0,00\")&\" \"&Dados!$I$2","v":"     c)  1100,86   Ω"}]
[null,null,{"$f":"IF(Dados!$AE$28=4,\"X\",\"\")","v":""},{"$f":"\"     d)  \"&TEXT(Dados!AD31,\"0,00\")&\" \"&Dados!$I$2","v":"     d)  956,93   Ω"},{"$nulls":9},"Pág. 1 de 2"]
[]
[null,"5) Qual a resistência equivalente (Req) do circuito?"]
[null,null,{"$f":"\"R1 = \"&Dados!AI28&IF(Dados!AI28=\"ABERTO\",\"\",\"  \"&Dados!$I$2)","v":"R1 = 470    Ω"},null,null,{"$f":"\"R2 = \"&Dados!AI29&IF(Dados!AI29=\"ABERTO\",\"\",\"  \"&Dados!$I$2)","v":"R2 = 120    Ω"},null,null,{"$f":"\"R3 = \"&Dados!AI30&IF(Dados!AI30=\"ABERTO\",\"\",\"  \"&Dados!$I$2)","v":"R3 = 100    Ω"},null,null,{"$f":"\"R4 = \"&Dados!AI31&IF(Dados!AI31=\"ABERTO\",\"\",\"  \"&Dados!$I$2)","v":"R4 = 2200    Ω"}]
[]
[null,null,"Resp.\naluno"]
[null,null,{"$f":"IF(Dados!$AM$28=1,\"X\",\"\")","v":""},{"$f":"\"     a)  \"&TEXT(Dados!AL28,\"0,00\")&\" \"&Dados!$I$2","v":"     a)  469,55   Ω"}]
[null,null,{"$f":"IF(Dados!$AM$28=2,\"X\",\"\")","v":""},{"$f":"\"     b)  \"&TEXT(Dados!AL29,\"0,00\")&\" \"&Dados!$I$2","v":"     b)  399,74   Ω"}]
[null,null,{"$f":"IF(Dados!$AM$28=3,\"X\",\"\")","v":""},{"$f":"\"     c)  \"&TEXT(Dados!AL30,\"0,00\")&\" \"&Dados!$I$2","v":"     c)  417,95   Ω"}]
[null,null,{"$f":"IF(Dados!$AM$28=4,\"X\",\"\")","v":""},{"$f":"\"     d)  \"&TEXT(Dados!AL31,\"0,00\")&\" \"&Dados!$I$2","v":"     d)  540,62   Ω"}]
[]
[null,"6) Qual a resistência equivalente (Req) do circuito?"]
[null,null,{"$f":"\"R1 = \"&Dados!AQ28&IF(Dados!AQ28=\"ABERTO\",\"\",\"  \"&Dados!$I$2)","v":"R1 = 120    Ω"},null,null,{"$f":"\"R2 = \"&Dados!AQ29&IF(Dados!AQ29=\"ABERTO\",\"\",\"  \"&Dados!$I$2)","v":"R2 = 10    Ω"},null,null,{"$f":"\"R3 = \"&Dados!AQ30&IF(Dados!AQ30=\"ABERTO\",\"\",\"  \"&Dados!$I$2)","v":"R3 = 470    Ω"},null,null,{"$f":"\"R4 = \"&Dados!AQ31&IF(Dados!AQ31=\"ABERTO\",\"\",\"  \"&Dados!$I$2)","v":"R4 = 1000    Ω"}]
[]
[null,null,"Resp.\naluno"]
[null,null,{"$f":"IF(Dados!$AU$28=1,\"X\",\"\")","v":""},{"$f":"\"     a)  \"&TEXT(Dados!AT28,\"0,00\")&\" \"&Dados!$I$2","v":"     a)  137,61   Ω"}]
[null,null,{"$f":"IF(Dados!$AU$28=2,\"X\",\"\")","v":""},{"$f":"\"     b)  \"&TEXT(Dados!AT29,\"0,00\")&\" \"&Dados!$I$2","v":"     b)  119,44   Ω"}]
[null,null,{"$f":"IF(Dados!$AU$28=3,\"X\",\"\")","v":""},{"$f":"\"     c)  \"&TEXT(Dados!AT30,\"0,00\")&\" \"&Dados!$I$2","v":"     c)  103,45   Ω"}]
[null,null,{"$f":"IF(Dados!$AU$28=4,\"X\",\"\")","v":""},{"$f":"\"     d)  \"&TEXT(Dados!AT31,\"0,00\")&\" \"&Dados!$I$2","v":"     d)  103,89   Ω"}]
[]
[null,"7) Qual a resistência equivalente (Req) do circuito?"]
[null,null,{"$f":"\"R1 = \"&Dados!AY28&IF(Dados!AY28=\"ABERTO\",\"\",\"  \"&Dados!$I$2)","v":"R1 = 10    Ω"},null,null,{"$f":"\"R2 = \"&Dados!AY29&IF(Dados!AY29=\"ABERTO\",\"\",\"  \"&Dados!$I$2)","v":"R2 = 150    Ω"},null,null,{"$f":"\"R3 = \"&Dados!AY30&IF(Dados!AY30=\"ABERTO\",\"\",\"  \"&Dados!$I$2)","v":"R3 = 8200    Ω"},null,null,{"$f":"\"R4 = \"&Dados!AY31&IF(Dados!AY31=\"ABERTO\",\"\",\"  \"&Dados!$I$2)","v":"R4 = 3900    Ω"}]
[]
[null,null,"Resp.\naluno"]
[null,null,{"$f":"IF(Dados!$BC$28=1,\"X\",\"\")","v":""},{"$f":"\"     a)  \"&TEXT(Dados!BB28,\"0,00\")&\" \"&Dados!$I$2","v":"     a)  136,61   Ω"}]
[null,null,{"$f":"IF(Dados!$BC$28=2,\"X\",\"\")","v":""},{"$f":"\"     b)  \"&TEXT(Dados!BB29,\"0,00\")&\" \"&Dados!$I$2","v":"     b)  157,91   Ω"}]
[null,null,{"$f":"IF(Dados!$BC$28=3,\"X\",\"\")","v":""},{"$f":"\"     c)  \"&TEXT(Dados!BB30,\"0,00\")&\" \"&Dados!$I$2","v":"     c)  141,37   Ω"}]
[null,null,{"$f":"IF(Dados!$BC$28=4,\"X\",\"\")","v":""},{"$f":"\"     d)  \"&TEXT(Dados!BB31,\"0,00\")&\" \"&Dados!$I$2","v":"     d)  182,11   Ω"}]
[]
[null,"8) Qual a resistência equivalente (Req) do circuito?"]
[null,null,{"$f":"\"R1 = \"&Dados!BG28&IF(Dados!BG28=\"ABERTO\",\"\",\"  \"&Dados!$I$2)","v":"R1 = 100    Ω"},null,null,{"$f":"\"R2 = \"&Dados!BG29&IF(Dados!BG29=\"ABERTO\",\"\",\"  \"&Dados!$I$2)","v":"R2 = 8200    Ω"},null,null,{"$f":"\"R3 = \"&Dados!BG30&IF(Dados!BG30=\"ABERTO\",\"\",\"  \"&Dados!$I$2)","v":"R3 = 120    Ω"},null,null,{"$f":"\"R4 = \"&Dados!BG31&IF(Dados!BG31=\"ABERTO\",\"\",\"  \"&Dados!$I$2)","v":"R4 = 1000    Ω"}]
[]
[null,null,"Resp.\naluno"]
[null,null,{"$f":"IF(Dados!$BK$28=1,\"X\",\"\")","v":""},{"$f":"\"     a)  \"&TEXT(Dados!BJ28,\"0,00\")&\" \"&Dados!$I$2","v":"     a)  986,84   Ω"}]
[null,null,{"$f":"IF(Dados!$BK$28=2,\"X\",\"\")","v":""},{"$f":"\"     b)  \"&TEXT(Dados!BJ29,\"0,00\")&\" \"&Dados!$I$2","v":"     b)  840,96   Ω"}]
[null,null,{"$f":"IF(Dados!$BK$28=3,\"X\",\"\")","v":""},{"$f":"\"     c)  \"&TEXT(Dados!BJ30,\"0,00\")&\" \"&Dados!$I$2","v":"     c)  1136,01   Ω"}]
[null,null,{"$f":"IF(Dados!$BK$28=4,\"X\",\"\")","v":""},{"$f":"\"     d)  \"&TEXT(Dados!BJ31,\"0,00\")&\" \"&Dados!$I$2","v":"     d)  875,70   Ω"}]
[]
[null,"9) Qual a resistência equivalente (Req) do circuito?"]
[null,null,{"$f":"\"R1 = \"&Dados!BO28&IF(Dados!BO28=\"ABERTO\",\"\",\"  \"&Dados!$I$2)","v":"R1 = 220    Ω"},null,null,{"$f":"\"R2 = \"&Dados!BO29&IF(Dados!BO29=\"ABERTO\",\"\",\"  \"&Dados!$I$2)","v":"R2 = 5600    Ω"},null,null,{"$f":"\"R3 = \"&Dados!BO30&IF(Dados!BO30=\"ABERTO\",\"\",\"  \"&Dados!$I$2)","v":"R3 = 100    Ω"},null,null,{"$f":"\"R4 = \"&Dados!BO31&IF(Dados!BO31=\"ABERTO\",\"\",\"  \"&Dados!$I$2)","v":"R4 = 2200    Ω"}]
[]
[null,null,"Resp.\naluno"]
[null,null,{"$f":"IF(Dados!$BS$28=1,\"X\",\"\")","v":""},{"$f":"\"     a)  \"&TEXT(Dados!BR28,\"0,00\")&\" \"&Dados!$I$2","v":"     a)  1470,77   Ω"}]
[null,null,{"$f":"IF(Dados!$BS$28=2,\"X\",\"\")","v":""},{"$f":"\"     b)  \"&TEXT(Dados!BR29,\"0,00\")&\" \"&Dados!$I$2","v":"     b)  1895,93   Ω"}]
[null,null,{"$f":"IF(Dados!$BS$28=3,\"X\",\"\")","v":""},{"$f":"\"     c)  \"&TEXT(Dados!BR30,\"0,00\")&\" \"&Dados!$I$2","v":"     c)  1402,49   Ω"}]
[null,null,{"$f":"IF(Dados!$BS$28=4,\"X\",\"\")","v":""},{"$f":"\"     d)  \"&TEXT(Dados!BR31,\"0,00\")&\" \"&Dados!$I$2","v":"     d)  1648,52   Ω"}]
[]
[null,"10) Qual a resistência equivalente (Req) do circuito?"]
[null,null,{"$f":"\"R1 = \"&Dados!BW28&IF(Dados!BW28=\"ABERTO\",\"\",\"  \"&Dados!$I$2)","v":"R1 = 10000    Ω"},null,null,{"$f":"\"R2 = \"&Dados!BW29&IF(Dados!BW29=\"ABERTO\",\"\",\"  \"&Dados!$I$2)","v":"R2 = 2200    Ω"},null,null,{"$f":"\"R3 = \"&Dados!BW30&IF(Dados!BW30=\"ABERTO\",\"\",\"  \"&Dados!$I$2)","v":"R3 = 0    Ω"},null,null,{"$f":"\"R4 = \"&Dados!BW31&IF(Dados!BW31=\"ABERTO\",\"\",\"  \"&Dados!$I$2)","v":"R4 = 120    Ω"}]
[]
[null,null,"Resp.\naluno"]
[null,null,{"$f":"IF(Dados!$CA$28=1,\"X\",\"\")","v":""},{"$f":"\"     a)  \"&TEXT(Dados!BZ28,\"0,00\")&\" \"&Dados!$I$2","v":"     a)  104,70   Ω"}]
[null,null,{"$f":"IF(Dados!$CA$28=2,\"X\",\"\")","v":""},{"$f":"\"     b)  \"&TEXT(Dados!BZ29,\"0,00\")&\" \"&Dados!$I$2","v":"     b)  137,93   Ω"}]
[null,null,{"$f":"IF(Dados!$CA$28=3,\"X\",\"\")","v":""},{"$f":"\"     c)  \"&TEXT(Dados!BZ30,\"0,00\")&\" \"&Dados!$I$2","v":"     c)  118,83   Ω"}]
[null,null,{"$f":"IF(Dados!$CA$28=4,\"X\",\"\")","v":""},{"$f":"\"     d)  \"&TEXT(Dados!BZ31,\"0,00\")&\" \"&Dados!$I$2","v":"     d)  105,03   Ω"},{"$nulls":9},"Pág. 2 de 2"]

{"sheet":"Tempo","index":3,"n_rows":2,"n_cols":1,"rows_kept":2,"hidden":true}
["Tempo faltante"]
[2666]